BDBM29007 (2R)-2-[(4-chlorobenzene)(2,5-difluorophenyl)sulfonamido]propyl N-[3-(1H-imidazol-1-yl)propyl]carbamate::Carbamate-appended N-alkylsulfonamide, 50
SMILES C[C@H](COC(=O)NCCCn1ccnc1)N(c1cc(F)ccc1F)S(=O)(=O)c1ccc(Cl)cc1
InChI Key InChIKey=VWBZOVFZMYPZCN-MRXNPFEDSA-N
Data  1 EC50
  Tab Delimited (TSV)   2D SDfile   Computed 3D by Vconf -m prep SDfile
Find this compound or compounds like it in BindingDB:
Activity Spreadsheet -- Enzyme Inhibition Constant Data from BindingDB
Found 1 hit for monomerid = 29007
LigandPNGBDBM29007((2R)-2-[(4-chlorobenzene)(2,5-difluorophenyl)sulfo...)
Affinity DataEC50:  1.20nM. Assay description: H4 human neuroglioma cells expressing beta-APP were aliquoted into a 96-well plate, and after attachment the medium was replaced with the conditioned...
In DepthDetails ArticlePubMed